Reaction Details
TargetCannabinoid receptor 1
LigandBDBM50354134
Substrate/Competitorn/a
Meas. Tech.ChEMBL_770824 (CHEMBL1837629)
IC50>10000±n/a nM
Citation Cichero, ELigresti, AAllarà, Mdi Marzo, VLazzati, ZD'Ursi, PMarabotti, AMilanesi, LSpallarossa, ARanise, AFossa, P Homology modeling in tandem with 3D-QSAR analyses: a computational approach to depict the agonist binding site of the human CB2 receptor. Eur J Med Chem46:4489-505 (2011) 
 
Cannabinoid receptor 1
Name:Cannabinoid receptor 1
Type:G Protein-Coupled Receptor (GPCR)
Mol. Mass.:52868.96
Organism:Homo sapiens (Human)
Description:P21554
Residue:472
BDBM50354134
NameBDBM50354134
Synonyms:CHEMBL1836188
TypeSmall organic molecule
Emp. Form.C27H30N2O3
Mol. Mass.430.5387
SMILESCCOC(=O)C(=C\c1cn(CCN2CCCCC2)c2ccccc12)\C(=O)c1ccccc1