Reaction Details
TargetCarbonic anhydrase 9
LigandBDBM50354403
Substrate/Competitorn/a
Meas. Tech.ChEMBL_770698 (CHEMBL1839823)
Ki 1.7±n/a nM
Citation Knaus, EEInnocenti, AScozzafava, ASupuran, CT Phenylethynylbenzenesulfonamide regioisomers strongly and selectively inhibit the transmembrane, tumor-associated carbonic anhydrase isoforms IX and XII over the cytosolic isoforms I and II. Bioorg Med Chem Lett21:5892-6 (2011) 
 
Carbonic anhydrase 9
Name:Carbonic anhydrase 9
Type:Enzyme
Mol. Mass.:49669.03
Organism:Homo sapiens (Human)
Description:Catalytic domain of human cloned isozyme was used in the assay
Residue:459
BDBM50354403
NameBDBM50354403
Synonyms:CHEMBL1836406
TypeSmall organic molecule
Emp. Form.C15H13NO3S
Mol. Mass.287.334
SMILESCOc1cccc(c1)C#Cc1cccc(c1)S(N)(=O)=O