Reaction Details
TargetAurora kinase B
LigandBDBM50354408
Substrate/Competitorn/a
Meas. Tech.ChEMBL_771347 (CHEMBL1839619)
IC50 754±n/a nM
Citation Zeng, HBelanger, DBCurran, PJShipps, GWMiao, HBracken, JBArshad Siddiqui, MMalkowski, MWang, Y Discovery of novel imidazo[1,2-a]pyrazin-8-amines as Brk/PTK6 inhibitors. Bioorg Med Chem Lett21:5870-5 (2011) 
 
Aurora kinase B
Name:Aurora kinase B
Type:Protein
Mol. Mass.:39327.72
Organism:Homo sapiens (Human)
Description:Q96GD4
Residue:344
BDBM50354408
NameBDBM50354408
Synonyms:CHEMBL1836867
TypeSmall organic molecule
Emp. Form.C21H21ClN8O
Mol. Mass.436.897
SMILESCc1cn2c(cnc2c(Nc2ccc(C(=O)N3CCNCC3)c(Cl)c2)n1)-c1cn[nH]c1