Reaction Details
TargetAurora kinase B
LigandBDBM50354429
Substrate/Competitorn/a
Meas. Tech.ChEMBL_771347 (CHEMBL1839619)
IC50 2739±n/a nM
Citation Zeng, HBelanger, DBCurran, PJShipps, GWMiao, HBracken, JBArshad Siddiqui, MMalkowski, MWang, Y Discovery of novel imidazo[1,2-a]pyrazin-8-amines as Brk/PTK6 inhibitors. Bioorg Med Chem Lett21:5870-5 (2011) 
 
Aurora kinase B
Name:Aurora kinase B
Type:Protein
Mol. Mass.:39327.72
Organism:Homo sapiens (Human)
Description:Q96GD4
Residue:344
BDBM50354429
NameBDBM50354429
Synonyms:CHEMBL1836846
TypeSmall organic molecule
Emp. Form.C25H25ClN8O
Mol. Mass.488.972
SMILESClc1cc(Nc2nc(cn3c(cnc23)-c2cn[nH]c2)C2CC2)ccc1C(=O)N1C[C@H]2CC[C@@H]1CN2