Reaction Details
TargetProtein-tyrosine kinase 6
LigandBDBM50354429
Substrate/Competitorn/a
Meas. Tech.ChEMBL_771346 (CHEMBL1839618)
IC50 45±n/a nM
Citation Zeng, HBelanger, DBCurran, PJShipps, GWMiao, HBracken, JBArshad Siddiqui, MMalkowski, MWang, Y Discovery of novel imidazo[1,2-a]pyrazin-8-amines as Brk/PTK6 inhibitors. Bioorg Med Chem Lett21:5870-5 (2011) 
 
Protein-tyrosine kinase 6
Name:Protein-tyrosine kinase 6
Type:Tyrosine-protein kinase
Mol. Mass.:51839.11
Organism:Homo sapiens (Human)
Description:n/a
Residue:451
BDBM50354429
NameBDBM50354429
Synonyms:CHEMBL1836846
TypeSmall organic molecule
Emp. Form.C25H25ClN8O
Mol. Mass.488.972
SMILESClc1cc(Nc2nc(cn3c(cnc23)-c2cn[nH]c2)C2CC2)ccc1C(=O)N1C[C@H]2CC[C@@H]1CN2