Reaction Details
TargetTyrosine-protein kinase Lck
LigandBDBM50354408
Substrate/Competitorn/a
Meas. Tech.ChEMBL_771348 (CHEMBL1839620)
IC50 420±n/a nM
Citation Zeng, HBelanger, DBCurran, PJShipps, GWMiao, HBracken, JBArshad Siddiqui, MMalkowski, MWang, Y Discovery of novel imidazo[1,2-a]pyrazin-8-amines as Brk/PTK6 inhibitors. Bioorg Med Chem Lett21:5870-5 (2011) 
 
Tyrosine-protein kinase Lck
Name:Tyrosine-protein kinase Lck
Type:n/a
Mol. Mass.:57987.83
Organism:Homo sapiens (Human)
Description:P06239
Residue:509
BDBM50354408
NameBDBM50354408
Synonyms:CHEMBL1836867
TypeSmall organic molecule
Emp. Form.C21H21ClN8O
Mol. Mass.436.897
SMILESCc1cn2c(cnc2c(Nc2ccc(C(=O)N3CCNCC3)c(Cl)c2)n1)-c1cn[nH]c1