Reaction Details
TargetProtein-tyrosine kinase 6
LigandBDBM50354424
Substrate/Competitorn/a
Meas. Tech.ChEMBL_771345 (CHEMBL1839617)
IC50 7±n/a nM
Citation Zeng, HBelanger, DBCurran, PJShipps, GWMiao, HBracken, JBArshad Siddiqui, MMalkowski, MWang, Y Discovery of novel imidazo[1,2-a]pyrazin-8-amines as Brk/PTK6 inhibitors. Bioorg Med Chem Lett21:5870-5 (2011) 
 
Protein-tyrosine kinase 6
Name:Protein-tyrosine kinase 6
Type:Tyrosine-protein kinase
Mol. Mass.:51839.11
Organism:Homo sapiens (Human)
Description:n/a
Residue:451
BDBM50354424
NameBDBM50354424
Synonyms:CHEMBL1836802
TypeSmall organic molecule
Emp. Form.C22H21F3N8O
Mol. Mass.470.4503
SMILESCc1cn2c(cnc2c(Nc2ccc(C(=O)N3CCNCC3)c(c2)C(F)(F)F)n1)-c1cn[nH]c1