Reaction Details
TargetProtein-tyrosine kinase 6
LigandBDBM50354431
Substrate/Competitorn/a
Meas. Tech.ChEMBL_771345 (CHEMBL1839617)
IC50 7±n/a nM
Citation Zeng, HBelanger, DBCurran, PJShipps, GWMiao, HBracken, JBArshad Siddiqui, MMalkowski, MWang, Y Discovery of novel imidazo[1,2-a]pyrazin-8-amines as Brk/PTK6 inhibitors. Bioorg Med Chem Lett21:5870-5 (2011) 
 
Protein-tyrosine kinase 6
Name:Protein-tyrosine kinase 6
Type:Tyrosine-protein kinase
Mol. Mass.:51839.11
Organism:Homo sapiens (Human)
Description:n/a
Residue:451
BDBM50354431
NameBDBM50354431
Synonyms:CHEMBL1836840
TypeSmall organic molecule
Emp. Form.C23H23ClN8O
Mol. Mass.462.935
SMILESCc1cn2c(cnc2c(Nc2ccc(C(=O)N3C[C@H]4CC[C@@H]3CN4)c(Cl)c2)n1)-c1cn[nH]c1