Reaction Details
TargetProtein-tyrosine kinase 6
LigandBDBM50354459
Substrate/Competitorn/a
Meas. Tech.ChEMBL_771345 (CHEMBL1839617)
IC50 12±n/a nM
Citation Zeng, HBelanger, DBCurran, PJShipps, GWMiao, HBracken, JBArshad Siddiqui, MMalkowski, MWang, Y Discovery of novel imidazo[1,2-a]pyrazin-8-amines as Brk/PTK6 inhibitors. Bioorg Med Chem Lett21:5870-5 (2011) 
 
Protein-tyrosine kinase 6
Name:Protein-tyrosine kinase 6
Type:Tyrosine-protein kinase
Mol. Mass.:51839.11
Organism:Homo sapiens (Human)
Description:n/a
Residue:451
BDBM50354459
NameBDBM50354459
Synonyms:CHEMBL1836761
TypeSmall organic molecule
Emp. Form.C16H16N8OS
Mol. Mass.368.416
SMILESCN(C)C(=O)c1cc(Nc2nc(C)cn3c(cnc23)-c2cn[nH]c2)sn1