Reaction Details
Target5-hydroxytryptamine receptor 7
LigandBDBM50354515
Substrate/Competitorn/a
Meas. Tech.ChEMBL_771581 (CHEMBL1837760)
Ki 0.38±n/a nM
Citation Volk, BGacsályi, IPallagi, KPoszávácz, LGyönös, ISzabó, EBakó, TSpedding, MSimig, GSzénási, G Optimization of (arylpiperazinylbutyl)oxindoles exhibiting selective 5-HT7 receptor antagonist activity. J Med Chem54:6657-69 (2011) 
 
5-hydroxytryptamine receptor 7
Name:5-hydroxytryptamine receptor 7
Type:G Protein-Coupled Receptor (GPCR)
Mol. Mass.:53573.08
Organism:Homo sapiens (Human)
Description:P34969
Residue:479
BDBM50354515
NameBDBM50354515
Synonyms:CHEMBL261719
TypeSmall organic molecule
Emp. Form.C24H30ClN3O
Mol. Mass.411.968
SMILESCCC1(CCCCN2CCN(CC2)c2ccc(Cl)cc2)C(=O)Nc2ccccc12