Reaction Details
TargetMuscarinic acetylcholine receptor M3
LigandBDBM50354568
Substrate/Competitorn/a
Meas. Tech.ChEMBL_771725 (CHEMBL1838343)
Ki 10±n/a nM
Citation Osborne, RClarke, NGlossop, PKenyon, ALiu, HPatel, SSummerhill, SJones, LH Efficient conversion of a nonselective norepinephrin reuptake inhibitor into a dual muscarinic antagonist-ß2-agonist for the treatment of chronic obstructive pulmonary disease. J Med Chem54:6998-7002 (2011) 
 
Muscarinic acetylcholine receptor M3
Name:Muscarinic acetylcholine receptor M3
Type:Enzyme
Mol. Mass.:66151.03
Organism:Homo sapiens (Human)
Description:P20309
Residue:590
BDBM50354568
NameBDBM50354568
Synonyms:CHEMBL1836645
TypeSmall organic molecule
Emp. Form.C18H18FN3O2
Mol. Mass.327.3528
SMILESOc1cccc(F)c1-n1nc(OC2CCNCC2)c2ccccc12