Reaction Details
TargetSodium-dependent noradrenaline transporter
LigandBDBM50354567
Substrate/Competitorn/a
Meas. Tech.ChEMBL_771726 (CHEMBL1838344)
Ki 6.8±n/a nM
Citation Osborne, RClarke, NGlossop, PKenyon, ALiu, HPatel, SSummerhill, SJones, LH Efficient conversion of a nonselective norepinephrin reuptake inhibitor into a dual muscarinic antagonist-ß2-agonist for the treatment of chronic obstructive pulmonary disease. J Med Chem54:6998-7002 (2011) 
 
Sodium-dependent noradrenaline transporter
Name:Sodium-dependent noradrenaline transporter
Type:Multi-pass membrane protein
Mol. Mass.:69337.72
Organism:Homo sapiens (Human)
Description:P23975
Residue:617
BDBM50354567
NameBDBM50354567
Synonyms:CHEMBL1836644
TypeSmall organic molecule
Emp. Form.C18H17F2N3O
Mol. Mass.329.3439
SMILESFc1cccc(F)c1-n1nc(OC2CCNCC2)c2ccccc12