Reaction Details
TargetDelta-type opioid receptor
LigandBDBM50354570
Substrate/Competitorn/a
Meas. Tech.ChEMBL_771899 (CHEMBL1839053)
Ki 1.6±n/a nM
Citation Cami-Kobeci, GPolgar, WEKhroyan, TVToll, LHusbands, SM Structural determinants of opioid and NOP receptor activity in derivatives of buprenorphine. J Med Chem54:6531-7 (2011) 
 
Delta-type opioid receptor
Name:Delta-type opioid receptor
Type:G Protein-Coupled Receptor (GPCR)
Mol. Mass.:40382.98
Organism:Homo sapiens (Human)
Description:Competition binding assays were carried out using membrane preparations from transfected HN9.10 cells that constitutively expressed the delta opioid receptor.
Residue:372
BDBM50354570
NameBDBM50354570
Synonyms:CHEMBL1834409
TypeSmall organic molecule
Emp. Form.C30H43NO4
Mol. Mass.481.6667
SMILESCCC(C)(C)[C@](C)(O)[C@H]1C[C@]23CC[C@]1(OC)[C@@H]1Oc4c5c(C[C@H]2N(CC2CC2)CC[C@@]315)ccc4O