Reaction Details
TargetNociceptin receptor
LigandBDBM50354570
Substrate/Competitorn/a
Meas. Tech.ChEMBL_771030 (CHEMBL1838552)
Ki 8.5±n/a nM
Citation Cami-Kobeci, GPolgar, WEKhroyan, TVToll, LHusbands, SM Structural determinants of opioid and NOP receptor activity in derivatives of buprenorphine. J Med Chem54:6531-7 (2011) 
 
Nociceptin receptor
Name:Nociceptin receptor
Type:G Protein-Coupled Receptor (GPCR)
Mol. Mass.:40702.87
Organism:Homo sapiens (Human)
Description:P41146
Residue:370
BDBM50354570
NameBDBM50354570
Synonyms:CHEMBL1834409
TypeSmall organic molecule
Emp. Form.C30H43NO4
Mol. Mass.481.6667
SMILESCCC(C)(C)[C@](C)(O)[C@H]1C[C@]23CC[C@]1(OC)[C@@H]1Oc4c5c(C[C@H]2N(CC2CC2)CC[C@@]315)ccc4O