Reaction Details
TargetKappa-type opioid receptor
LigandBDBM50026603
Substrate/Competitorn/a
Meas. Tech.ChEMBL_771900 (CHEMBL1839054)
Ki 2.5±n/a nM
Citation Cami-Kobeci, GPolgar, WEKhroyan, TVToll, LHusbands, SM Structural determinants of opioid and NOP receptor activity in derivatives of buprenorphine. J Med Chem54:6531-7 (2011) 
 
Kappa-type opioid receptor
Name:Kappa-type opioid receptor
Type:G Protein-Coupled Receptor (GPCR)
Mol. Mass.:42648.76
Organism:Homo sapiens (Human)
Description:P41145
Residue:380
BDBM50026603
NameBDBM50026603
Synonyms:Buprenorphine | CHEBI:3216
TypeSmall organic molecule
Emp. Form.C29H41NO4
Mol. Mass.467.6401
SMILES[H][C@@]12Oc3c4c(C[C@@]5([H])N(CC6CC6)CC[C@@]14[C@@]51CC[C@@]2(OC)[C@]([H])(C1)[C@](C)(O)C(C)(C)C)ccc3O