Reaction Details
TargetMu-type opioid receptor
LigandBDBM50354573
Substrate/Competitorn/a
Meas. Tech.ChEMBL_771898 (CHEMBL1838909)
Ki 5.6±n/a nM
Citation Cami-Kobeci, GPolgar, WEKhroyan, TVToll, LHusbands, SM Structural determinants of opioid and NOP receptor activity in derivatives of buprenorphine. J Med Chem54:6531-7 (2011) 
 
Mu-type opioid receptor
Name:Mu-type opioid receptor
Type:G Protein-Coupled Receptor (GPCR)
Mol. Mass.:44789.51
Organism:Homo sapiens (Human)
Description:P35372
Residue:400
BDBM50354573
NameBDBM50354573
Synonyms:CHEMBL1834412
TypeSmall organic molecule
Emp. Form.C35H45NO4
Mol. Mass.543.7361
SMILESCO[C@]12CC[C@@]3(C[C@@H]1[C@@](C)(O)c1ccc(cc1)C(C)(C)C)[C@H]1Cc4ccc(O)c5O[C@@H]2[C@]3(CCN1CC1CC1)c45