Reaction Details
TargetMu-type opioid receptor
LigandBDBM50354576
Substrate/Competitorn/a
Meas. Tech.ChEMBL_771898 (CHEMBL1838909)
Ki 13±n/a nM
Citation Cami-Kobeci, GPolgar, WEKhroyan, TVToll, LHusbands, SM Structural determinants of opioid and NOP receptor activity in derivatives of buprenorphine. J Med Chem54:6531-7 (2011) 
 
Mu-type opioid receptor
Name:Mu-type opioid receptor
Type:G Protein-Coupled Receptor (GPCR)
Mol. Mass.:44789.51
Organism:Homo sapiens (Human)
Description:P35372
Residue:400
BDBM50354576
NameBDBM50354576
Synonyms:CHEMBL1834415
TypeSmall organic molecule
Emp. Form.C29H40ClNO4
Mol. Mass.502.085
SMILESCO[C@]12CC[C@@]3(C[C@@H]1[C@@](C)(O)C(C)(C)C)[C@H]1Cc4c5c(O[C@@H]2[C@@]35CCN1CC1CC1)c(O)cc4Cl