Reaction Details
TargetNociceptin receptor
LigandBDBM50354574
Substrate/Competitorn/a
Meas. Tech.ChEMBL_771035 (CHEMBL1838557)
EC50 111±n/a nM
Citation Cami-Kobeci, GPolgar, WEKhroyan, TVToll, LHusbands, SM Structural determinants of opioid and NOP receptor activity in derivatives of buprenorphine. J Med Chem54:6531-7 (2011) 
 
Nociceptin receptor
Name:Nociceptin receptor
Type:G Protein-Coupled Receptor (GPCR)
Mol. Mass.:40702.87
Organism:Homo sapiens (Human)
Description:P41146
Residue:370
BDBM50354574
NameBDBM50354574
Synonyms:CHEMBL1834413
TypeSmall organic molecule
Emp. Form.C33H45NO4
Mol. Mass.519.7147
SMILESCO[C@]12CC[C@@]3(C[C@@H]1[C@](C)(O)CC1CC4CCC1C4)[C@H]1Cc4ccc(O)c5O[C@@H]2[C@]3(CCN1CC1CC1)c45