Reaction Details
Target5-hydroxytryptamine receptor 1A
LigandBDBM50354585
Substrate/Competitorn/a
Meas. Tech.ChEMBL_771223 (CHEMBL1839305)
Ki>1000±n/a nM
Citation van Loevezijn, AVenhorst, JIwema Bakker, WIde Korte, CGde Looff, WVerhoog, Svan Wees, JWvan Hoeve, Mvan de Woestijne, RPvan der Neut, MABorst, AJvan Dongen, MJde Bruin, NMKeizer, HGKruse, CG N'-(arylsulfonyl)pyrazoline-1-carboxamidines as novel, neutral 5-hydroxytryptamine 6 receptor (5-HT6R) antagonists with unique structural features. J Med Chem54:7030-54 (2011) 
 
5-hydroxytryptamine receptor 1A
Name:5-hydroxytryptamine receptor 1A
Type:n/a
Mol. Mass.:46122.49
Organism:Homo sapiens (Human)
Description:n/a
Residue:422
BDBM50354585
NameBDBM50354585
Synonyms:CHEMBL1834226
TypeSmall organic molecule
Emp. Form.C14H19ClN4O2S
Mol. Mass.342.844
SMILESCCN=C(NS(=O)(=O)c1cccc(Cl)c1)N1CC(CC)C=N1