Reaction Details
Target5-hydroxytryptamine receptor 1D
LigandBDBM50354585
Substrate/Competitorn/a
Meas. Tech.ChEMBL_771224 (CHEMBL1839306)
Ki>1000±n/a nM
Citation van Loevezijn, AVenhorst, JIwema Bakker, WIde Korte, CGde Looff, WVerhoog, Svan Wees, JWvan Hoeve, Mvan de Woestijne, RPvan der Neut, MABorst, AJvan Dongen, MJde Bruin, NMKeizer, HGKruse, CG N'-(arylsulfonyl)pyrazoline-1-carboxamidines as novel, neutral 5-hydroxytryptamine 6 receptor (5-HT6R) antagonists with unique structural features. J Med Chem54:7030-54 (2011) 
 
5-hydroxytryptamine receptor 1D
Name:5-hydroxytryptamine receptor 1D
Type:G Protein-Coupled Receptor (GPCR)
Mol. Mass.:41920.63
Organism:Homo sapiens (Human)
Description:Receptor binding assays were performed using human clone stably expressed in CHO cells.
Residue:377
BDBM50354585
NameBDBM50354585
Synonyms:CHEMBL1834226
TypeSmall organic molecule
Emp. Form.C14H19ClN4O2S
Mol. Mass.342.844
SMILESCCN=C(NS(=O)(=O)c1cccc(Cl)c1)N1CC(CC)C=N1