Reaction Details
Target5-hydroxytryptamine receptor 2C
LigandBDBM50354586
Substrate/Competitorn/a
Meas. Tech.ChEMBL_771222 (CHEMBL1839304)
Ki>1000±n/a nM
Citation van Loevezijn, AVenhorst, JIwema Bakker, WIde Korte, CGde Looff, WVerhoog, Svan Wees, JWvan Hoeve, Mvan de Woestijne, RPvan der Neut, MABorst, AJvan Dongen, MJde Bruin, NMKeizer, HGKruse, CG N'-(arylsulfonyl)pyrazoline-1-carboxamidines as novel, neutral 5-hydroxytryptamine 6 receptor (5-HT6R) antagonists with unique structural features. J Med Chem54:7030-54 (2011) 
 
5-hydroxytryptamine receptor 2C
Name:5-hydroxytryptamine receptor 2C
Type:G Protein-Coupled Receptor (GPCR)
Mol. Mass.:51836.79
Organism:Homo sapiens (Human)
Description:P28335
Residue:458
BDBM50354586
NameBDBM50354586
Synonyms:CHEMBL1834234
TypeSmall organic molecule
Emp. Form.C18H19ClN4O2S
Mol. Mass.390.887
SMILESCCN=C(NS(=O)(=O)c1cccc(Cl)c1)N1N=CCC1c1ccccc1