Reaction Details
TargetCannabinoid receptor 1
LigandBDBM86514
Substrate/Competitorn/a
Meas. Tech.ChEMBL_772340 (CHEMBL1838785)
Ki 55.4±n/a nM
Citation Teng, HThakur, GAMakriyannis, A Conformationally constrained analogs of BAY 59-3074 as novel cannabinoid receptor ligands. Bioorg Med Chem Lett21:5999-6002 (2011) 
 
Cannabinoid receptor 1
Name:Cannabinoid receptor 1
Type:G Protein-Coupled Receptor (GPCR)
Mol. Mass.:52856.55
Organism:Rattus norvegicus (rat)
Description:P20272
Residue:473
BDBM86514
NameBDBM86514
Synonyms:BAY 59-3074 CHEMBL1354658
TypeSmall organic molecule
Emp. Form.C18H13F6NO4S
Mol. Mass.453.356
SMILESFC(F)(F)CCCS(=O)(=O)Oc1cccc(Oc2cccc(c2C#N)C(F)(F)F)c1