Reaction Details
TargetMu-type opioid receptor
LigandBDBM50354993
Substrate/Competitorn/a
Meas. Tech.ChEMBL_772110 (CHEMBL1837876)
Ki 2.6±n/a nM
Citation Nagase, HKoyano, KWada, NHirayama, SWatanabe, ANemoto, TNakajima, MNakao, KMochizuki, HFujii, H Synthesis of novel triplet drugs with 1,3,5-trioxazatriquinane skeletons and their pharmacologies. Part 2: Synthesis of novel triplet drugs with the epoxymethano structure (capped homotriplet). Bioorg Med Chem Lett21:6198-202 (2011) 
 
Mu-type opioid receptor
Name:Mu-type opioid receptor
Type:Enzyme Catalytic Domain
Mol. Mass.:44431.62
Organism:MOUSE
Description:OPIATE Mu OPRM1 MOUSE::P42866
Residue:398
BDBM50354993
NameBDBM50354993
Synonyms:CHEMBL1834898
TypeSmall organic molecule
Emp. Form.C46H55N3O9
Mol. Mass.793.9436
SMILESOc1ccc2C[C@H]3N(CC4CCC4)CC[C@@]45[C@@H](Oc1c24)[C@]1(CC[C@@]35O)O[C@H]2CO[C@@H]3N2[C@H]1O[C@]31CC[C@@]2(O)[C@H]3Cc4ccc(O)c5O[C@@H]1[C@]2(CCN3CC1CCC1)c45