Reaction Details
TargetDelta-type opioid receptor
LigandBDBM50354999
Substrate/Competitorn/a
Meas. Tech.ChEMBL_772111 (CHEMBL1837877)
Ki 52.86±n/a nM
Citation Nagase, HKoyano, KWada, NHirayama, SWatanabe, ANemoto, TNakajima, MNakao, KMochizuki, HFujii, H Synthesis of novel triplet drugs with 1,3,5-trioxazatriquinane skeletons and their pharmacologies. Part 2: Synthesis of novel triplet drugs with the epoxymethano structure (capped homotriplet). Bioorg Med Chem Lett21:6198-202 (2011) 
 
Delta-type opioid receptor
Name:Delta-type opioid receptor
Type:Enzyme Catalytic Domain
Mol. Mass.:40577.25
Organism:MOUSE
Description:P32300
Residue:372
BDBM50354999
NameBDBM50354999
Synonyms:CHEMBL1834896
TypeSmall organic molecule
Emp. Form.C38H43N3O9
Mol. Mass.685.7627
SMILESCN1CC[C@@]23[C@H]4Oc5c2c(C[C@@H]1[C@]3(O)CC[C@]41O[C@@H]2N3[C@H](CO[C@@H]13)O[C@]21CC[C@@]2(O)[C@H]3Cc4ccc(O)c6O[C@@H]1[C@]2(CCN3C)c46)ccc5O