Reaction Details
TargetB1 bradykinin receptor
LigandBDBM50355058
Substrate/Competitorn/a
Meas. Tech.ChEMBL_772684 (CHEMBL1837152)
Ki 2.5±n/a nM
Citation Biswas, KPeterkin, TABryan, MCArik, LLehto, SGSun, HHsieh, FYXu, CFremeau, RTAllen, JR Discovery of potent, orally bioavailable phthalazinone bradykinin B1 receptor antagonists. J Med Chem54:7232-46 (2011) 
 
B1 bradykinin receptor
Name:B1 bradykinin receptor
Type:Enzyme
Mol. Mass.:40508.87
Organism:Homo sapiens (Human)
Description:P46663
Residue:353
BDBM50355058
NameBDBM50355058
Synonyms:CHEMBL1834750
TypeSmall organic molecule
Emp. Form.C31H31ClN4O3
Mol. Mass.543.056
SMILESCc1nn(-c2ccc(cc2)C(=O)N[C@@H]2CCOc3cc(CN4CCCCC4)ccc23)c(=O)c2c(Cl)cccc12