Reaction Details
TargetB1 bradykinin receptor
LigandBDBM50244617
Substrate/Competitorn/a
Meas. Tech.ChEMBL_772684 (CHEMBL1837152)
Ki 4.1±n/a nM
Citation Biswas, KPeterkin, TABryan, MCArik, LLehto, SGSun, HHsieh, FYXu, CFremeau, RTAllen, JR Discovery of potent, orally bioavailable phthalazinone bradykinin B1 receptor antagonists. J Med Chem54:7232-46 (2011) 
 
B1 bradykinin receptor
Name:B1 bradykinin receptor
Type:Enzyme
Mol. Mass.:40508.87
Organism:Homo sapiens (Human)
Description:P46663
Residue:353
BDBM50244617
NameBDBM50244617
Synonyms:(2R,3S)-2,3-dihydroxy-N-((R)-6-(piperidin-1-ylmethyl)-1,2,3,4-tetrahydronaphthalen-1-yl)-4-(3-(trifluoromethyl)phenylsulfonyl)butanamide | CHEMBL455642
TypeSmall organic molecule
Emp. Form.C27H33F3N2O5S
Mol. Mass.554.622
SMILESO[C@H](CS(=O)(=O)c1cccc(c1)C(F)(F)F)[C@@H](O)C(=O)N[C@@H]1CCCc2cc(CN3CCCCC3)ccc12