Reaction Details
TargetB1 bradykinin receptor
LigandBDBM50355061
Substrate/Competitorn/a
Meas. Tech.ChEMBL_772684 (CHEMBL1837152)
Ki 4.7±n/a nM
Citation Biswas, KPeterkin, TABryan, MCArik, LLehto, SGSun, HHsieh, FYXu, CFremeau, RTAllen, JR Discovery of potent, orally bioavailable phthalazinone bradykinin B1 receptor antagonists. J Med Chem54:7232-46 (2011) 
 
B1 bradykinin receptor
Name:B1 bradykinin receptor
Type:Enzyme
Mol. Mass.:40508.87
Organism:Homo sapiens (Human)
Description:P46663
Residue:353
BDBM50355061
NameBDBM50355061
Synonyms:CHEMBL1834618
TypeSmall organic molecule
Emp. Form.C32H33ClN4O2
Mol. Mass.541.083
SMILESCc1nn(-c2ccc(cc2)C(=O)N[C@@H]2CCCc3cc(CN4CCCCC4)ccc23)c(=O)c2ccc(Cl)cc12