Reaction Details
TargetB1 bradykinin receptor
LigandBDBM50355063
Substrate/Competitorn/a
Meas. Tech.ChEMBL_772686 (CHEMBL1837154)
IC50 0.18±n/a nM
Citation Biswas, KPeterkin, TABryan, MCArik, LLehto, SGSun, HHsieh, FYXu, CFremeau, RTAllen, JR Discovery of potent, orally bioavailable phthalazinone bradykinin B1 receptor antagonists. J Med Chem54:7232-46 (2011) 
 
B1 bradykinin receptor
Name:B1 bradykinin receptor
Type:Enzyme
Mol. Mass.:40508.87
Organism:Homo sapiens (Human)
Description:P46663
Residue:353
BDBM50355063
NameBDBM50355063
Synonyms:CHEMBL1834619
TypeSmall organic molecule
Emp. Form.C31H32ClN5O2
Mol. Mass.542.071
SMILESCc1nn(-c2ccc(cn2)C(=O)N[C@@H]2CCCc3cc(CN4CCCCC4)ccc23)c(=O)c2c(Cl)cccc12