Reaction Details
TargetKappa-type opioid receptor
LigandBDBM50355118
Substrate/Competitorn/a
Meas. Tech.ChEMBL_772292 (CHEMBL1838614)
Ki>10000±n/a nM
Citation Liu, JYu, LFEaton, JBCaldarone, BCavino, KRuiz, CTerry, MFedolak, AWang, DGhavami, ALowe, DABrunner, DLukas, RJKozikowski, AP Discovery of isoxazole analogues of sazetidine-A as selectivea4ß2-nicotinic acetylcholine receptor partial agonists for the treatment of depression. J Med Chem54:7280-8 (2011) 
 
Kappa-type opioid receptor
Name:Kappa-type opioid receptor
Type:G Protein-Coupled Receptor (GPCR)
Mol. Mass.:42648.76
Organism:Homo sapiens (Human)
Description:P41145
Residue:380
BDBM50355118
NameBDBM50355118
Synonyms:CHEMBL1835609
TypeSmall organic molecule
Emp. Form.C15H19N3O3
Mol. Mass.289.3297
SMILESOCCCc1cc(on1)-c1cncc(OC[C@@H]2CCN2)c1