Reaction Details
TargetAurora kinase A
LigandBDBM50355466
Substrate/Competitorn/a
Meas. Tech.ChEMBL_773458 (CHEMBL1840410)
Ki 2000±n/a nM
Citation Davies, RJPierce, ACForster, CGrey, RXu, JArnost, MChoquette, DGalullo, VTian, SKHenkel, GChen, GHeidary, DKMa, JStuver-Moody, CNamchuk, M Design, synthesis, and evaluation of a novel dual FMS-like tyrosine kinase 3/stem cell factor receptor (FLT3/c-KIT) inhibitor for the treatment of acute myelogenous leukemia. J Med Chem54:7184-92 (2011) 
 
Aurora kinase A
Name:Aurora kinase A
Type:Serine/threonine-protein kinase
Mol. Mass.:45830.98
Organism:Homo sapiens (Human)
Description:O14965
Residue:403
BDBM50355466
NameBDBM50355466
Synonyms:CHEMBL1835742
TypeSmall organic molecule
Emp. Form.C13H11ClN6
Mol. Mass.286.72
SMILESNc1nc(Nc2ccccc2Cl)nn1-c1ccccn1