Reaction Details
TargetTyrosine-protein kinase JAK2
LigandBDBM50355469
Substrate/Competitorn/a
Meas. Tech.ChEMBL_773459 (CHEMBL1840411)
Ki>4000±n/a nM
Citation Davies, RJPierce, ACForster, CGrey, RXu, JArnost, MChoquette, DGalullo, VTian, SKHenkel, GChen, GHeidary, DKMa, JStuver-Moody, CNamchuk, M Design, synthesis, and evaluation of a novel dual FMS-like tyrosine kinase 3/stem cell factor receptor (FLT3/c-KIT) inhibitor for the treatment of acute myelogenous leukemia. J Med Chem54:7184-92 (2011) 
 
Tyrosine-protein kinase JAK2
Name:Tyrosine-protein kinase JAK2
Type:Protein
Mol. Mass.:130684.68
Organism:Homo sapiens (Human)
Description:O60674
Residue:1132
BDBM50355469
NameBDBM50355469
Synonyms:CHEMBL1835744
TypeSmall organic molecule
Emp. Form.C14H10ClN7
Mol. Mass.311.729
SMILESNc1nc(Nc2ccccc2Cl)nn1-c1ccc(cn1)C#N