Reaction Details
TargetReceptor-type tyrosine-protein kinase FLT3
LigandBDBM50355472
Substrate/Competitorn/a
Meas. Tech.ChEMBL_773456 (CHEMBL1840408)
Ki 42±n/a nM
Citation Davies, RJPierce, ACForster, CGrey, RXu, JArnost, MChoquette, DGalullo, VTian, SKHenkel, GChen, GHeidary, DKMa, JStuver-Moody, CNamchuk, M Design, synthesis, and evaluation of a novel dual FMS-like tyrosine kinase 3/stem cell factor receptor (FLT3/c-KIT) inhibitor for the treatment of acute myelogenous leukemia. J Med Chem54:7184-92 (2011) 
 
Receptor-type tyrosine-protein kinase FLT3
Name:Receptor-type tyrosine-protein kinase FLT3
Type:Enzyme
Mol. Mass.:112888.62
Organism:Homo sapiens (Human)
Description:P36888
Residue:993
BDBM50355472
NameBDBM50355472
Synonyms:CHEMBL1835661
TypeSmall organic molecule
Emp. Form.C17H19N5O3
Mol. Mass.341.3645
SMILESCOc1cc(Nc2nc(N)n(n2)-c2ccccc2)cc(OC)c1OC