Reaction Details
TargetMast/stem cell growth factor receptor Kit
LigandBDBM50355482
Substrate/Competitorn/a
Meas. Tech.ChEMBL_773457 (CHEMBL1840409)
Ki 38±n/a nM
Citation Davies, RJPierce, ACForster, CGrey, RXu, JArnost, MChoquette, DGalullo, VTian, SKHenkel, GChen, GHeidary, DKMa, JStuver-Moody, CNamchuk, M Design, synthesis, and evaluation of a novel dual FMS-like tyrosine kinase 3/stem cell factor receptor (FLT3/c-KIT) inhibitor for the treatment of acute myelogenous leukemia. J Med Chem54:7184-92 (2011) 
 
Mast/stem cell growth factor receptor Kit
Name:Mast/stem cell growth factor receptor Kit
Type:Protein
Mol. Mass.:109869.37
Organism:Homo sapiens (Human)
Description:P10721
Residue:976
BDBM50355482
NameBDBM50355482
Synonyms:CHEMBL1835749
TypeSmall organic molecule
Emp. Form.C20H24N8O2
Mol. Mass.408.457
SMILESNc1nc(Nc2ccc(cc2)C(=O)NCCN2CCOCC2)nn1-c1ccccn1