Reaction Details
TargetSerine/threonine-protein kinase Chk1
LigandBDBM50355562
Substrate/Competitorn/a
Meas. Tech.ChEMBL_776689 (CHEMBL1913786)
IC50>100000±n/a nM
Citation Andreani, AGranaiola, MLeoni, ALocatelli, AMorigi, RRambaldi, MVaroli, LLannigan, DSmith, JScudiero, DKondapaka, SShoemaker, RH Imidazo[2,1-b]thiazole guanylhydrazones as RSK2 inhibitors. Eur J Med Chem46:4311-23 (2011) 
 
Serine/threonine-protein kinase Chk1
Name:Serine/threonine-protein kinase Chk1
Type:Enzyme Catalytic Domain
Mol. Mass.:54443.02
Organism:Homo sapiens (Human)
Description:gi_166295192
Residue:476
BDBM50355562
NameBDBM50355562
Synonyms:CHEMBL1910630
TypeSmall organic molecule
Emp. Form.C15H15N7O4S
Mol. Mass.389.389
SMILESCOc1cc(c(OC)cc1-c1nc2sccn2c1\C=N\NC(N)=N)[N+]([O-])=O