Reaction Details
TargetSerine/threonine-protein kinase Chk1
LigandBDBM50355552
Substrate/Competitorn/a
Meas. Tech.ChEMBL_776689 (CHEMBL1913786)
IC50>100000±n/a nM
Citation Andreani, AGranaiola, MLeoni, ALocatelli, AMorigi, RRambaldi, MVaroli, LLannigan, DSmith, JScudiero, DKondapaka, SShoemaker, RH Imidazo[2,1-b]thiazole guanylhydrazones as RSK2 inhibitors. Eur J Med Chem46:4311-23 (2011) 
 
Serine/threonine-protein kinase Chk1
Name:Serine/threonine-protein kinase Chk1
Type:Enzyme Catalytic Domain
Mol. Mass.:54443.02
Organism:Homo sapiens (Human)
Description:gi_166295192
Residue:476
BDBM50355552
NameBDBM50355552
Synonyms:CHEMBL1910375
TypeSmall organic molecule
Emp. Form.C14H10ClN7S
Mol. Mass.343.794
SMILESNC(=N)N\N=C\c1c(nc2sc(Cl)cn12)-c1ccc(cc1)C#N