Reaction Details
TargetSerine/threonine-protein kinase Chk1
LigandBDBM50355573
Substrate/Competitorn/a
Meas. Tech.ChEMBL_776689 (CHEMBL1913786)
IC50>100000±n/a nM
Citation Andreani, AGranaiola, MLeoni, ALocatelli, AMorigi, RRambaldi, MVaroli, LLannigan, DSmith, JScudiero, DKondapaka, SShoemaker, RH Imidazo[2,1-b]thiazole guanylhydrazones as RSK2 inhibitors. Eur J Med Chem46:4311-23 (2011) 
 
Serine/threonine-protein kinase Chk1
Name:Serine/threonine-protein kinase Chk1
Type:Enzyme Catalytic Domain
Mol. Mass.:54443.02
Organism:Homo sapiens (Human)
Description:gi_166295192
Residue:476
BDBM50355573
NameBDBM50355573
Synonyms:CHEMBL1910747
TypeSmall organic molecule
Emp. Form.C16H17N7O2S
Mol. Mass.371.417
SMILESCCCc1cn2c(\C=N\NC(N)=N)c(nc2s1)-c1cccc(c1)[N+]([O-])=O