Reaction Details
TargetRibosomal protein S6 kinase alpha-3
LigandBDBM50355579
Substrate/Competitorn/a
Meas. Tech.ChEMBL_776690 (CHEMBL1913787)
IC50>100000±n/a nM
Citation Andreani, AGranaiola, MLeoni, ALocatelli, AMorigi, RRambaldi, MVaroli, LLannigan, DSmith, JScudiero, DKondapaka, SShoemaker, RH Imidazo[2,1-b]thiazole guanylhydrazones as RSK2 inhibitors. Eur J Med Chem46:4311-23 (2011) 
 
Ribosomal protein S6 kinase alpha-3
Name:Ribosomal protein S6 kinase alpha-3
Type:Serine/threonine-protein kinase
Mol. Mass.:83740.03
Organism:Homo sapiens (Human)
Description:The human RSK2 sequence differed from the Genbank entry NM_004586 at one residue, V45G. The protein was cloned and purified from baculovirus expression system.
Residue:740
BDBM50355579
NameBDBM50355579
Synonyms:CHEMBL1910609
TypeSmall organic molecule
Emp. Form.C13H9Cl3N6S2
Mol. Mass.419.74
SMILESClc1cc(c(Cl)s1)-c1nc2sc(Cl)cn2c1\C=N\NC1=NCCN1