Reaction Details
TargetSerine/threonine-protein kinase Chk2
LigandBDBM50355555
Substrate/Competitorn/a
Meas. Tech.ChEMBL_776643 (CHEMBL1913740)
IC50>100000±n/a nM
Citation Andreani, AGranaiola, MLeoni, ALocatelli, AMorigi, RRambaldi, MVaroli, LLannigan, DSmith, JScudiero, DKondapaka, SShoemaker, RH Imidazo[2,1-b]thiazole guanylhydrazones as RSK2 inhibitors. Eur J Med Chem46:4311-23 (2011) 
 
Serine/threonine-protein kinase Chk2
Name:Serine/threonine-protein kinase Chk2
Type:Protein
Mol. Mass.:60908.59
Organism:Homo sapiens (Human)
Description:O96017
Residue:543
BDBM50355555
NameBDBM50355555
Synonyms:CHEMBL1910614
TypeSmall organic molecule
Emp. Form.C19H17N7O4S
Mol. Mass.439.448
SMILESCOc1cc(c(OC)cc1-c1nc2sc3ccccc3n2c1\C=N\[NH+]=C(\N)[NH-])[N+]([O-])=O