Reaction Details
TargetRibosomal protein S6 kinase alpha-3
LigandBDBM50355586
Substrate/Competitorn/a
Meas. Tech.ChEMBL_776690 (CHEMBL1913787)
IC50>100000±n/a nM
Citation Andreani, AGranaiola, MLeoni, ALocatelli, AMorigi, RRambaldi, MVaroli, LLannigan, DSmith, JScudiero, DKondapaka, SShoemaker, RH Imidazo[2,1-b]thiazole guanylhydrazones as RSK2 inhibitors. Eur J Med Chem46:4311-23 (2011) 
 
Ribosomal protein S6 kinase alpha-3
Name:Ribosomal protein S6 kinase alpha-3
Type:Serine/threonine-protein kinase
Mol. Mass.:83740.03
Organism:Homo sapiens (Human)
Description:The human RSK2 sequence differed from the Genbank entry NM_004586 at one residue, V45G. The protein was cloned and purified from baculovirus expression system.
Residue:740
BDBM50355586
NameBDBM50355586
Synonyms:CHEMBL1910376
TypeSmall organic molecule
Emp. Form.C11H9Cl2N7S2
Mol. Mass.374.272
SMILESCc1nn2c(\C=N\NC(N)=N)c(nc2s1)-c1cc(Cl)sc1Cl