Reaction Details
TargetSerine/threonine-protein kinase Chk2
LigandBDBM50355586
Substrate/Competitorn/a
Meas. Tech.ChEMBL_776643 (CHEMBL1913740)
IC50>20000±n/a nM
Citation Andreani, AGranaiola, MLeoni, ALocatelli, AMorigi, RRambaldi, MVaroli, LLannigan, DSmith, JScudiero, DKondapaka, SShoemaker, RH Imidazo[2,1-b]thiazole guanylhydrazones as RSK2 inhibitors. Eur J Med Chem46:4311-23 (2011) 
 
Serine/threonine-protein kinase Chk2
Name:Serine/threonine-protein kinase Chk2
Type:Protein
Mol. Mass.:60908.59
Organism:Homo sapiens (Human)
Description:O96017
Residue:543
BDBM50355586
NameBDBM50355586
Synonyms:CHEMBL1910376
TypeSmall organic molecule
Emp. Form.C11H9Cl2N7S2
Mol. Mass.374.272
SMILESCc1nn2c(\C=N\NC(N)=N)c(nc2s1)-c1cc(Cl)sc1Cl