Reaction Details
TargetSerine/threonine-protein kinase Chk2
LigandBDBM50355591
Substrate/Competitorn/a
Meas. Tech.ChEMBL_776643 (CHEMBL1913740)
IC50>100000±n/a nM
Citation Andreani, AGranaiola, MLeoni, ALocatelli, AMorigi, RRambaldi, MVaroli, LLannigan, DSmith, JScudiero, DKondapaka, SShoemaker, RH Imidazo[2,1-b]thiazole guanylhydrazones as RSK2 inhibitors. Eur J Med Chem46:4311-23 (2011) 
 
Serine/threonine-protein kinase Chk2
Name:Serine/threonine-protein kinase Chk2
Type:Protein
Mol. Mass.:60908.59
Organism:Homo sapiens (Human)
Description:O96017
Residue:543
BDBM50355591
NameBDBM50355591
Synonyms:CHEMBL1910600
TypeSmall organic molecule
Emp. Form.C13H10F2N6S
Mol. Mass.320.321
SMILESNC(=N)N\N=C/c1c(nc2sccn12)-c1ccc(F)c(F)c1