Reaction Details
TargetSerine/threonine-protein kinase Chk2
LigandBDBM50355608
Substrate/Competitorn/a
Meas. Tech.ChEMBL_776643 (CHEMBL1913740)
IC50 34320±n/a nM
Citation Andreani, AGranaiola, MLeoni, ALocatelli, AMorigi, RRambaldi, MVaroli, LLannigan, DSmith, JScudiero, DKondapaka, SShoemaker, RH Imidazo[2,1-b]thiazole guanylhydrazones as RSK2 inhibitors. Eur J Med Chem46:4311-23 (2011) 
 
Serine/threonine-protein kinase Chk2
Name:Serine/threonine-protein kinase Chk2
Type:Protein
Mol. Mass.:60908.59
Organism:Homo sapiens (Human)
Description:O96017
Residue:543
BDBM50355608
NameBDBM50355608
Synonyms:CHEMBL1910762
TypeSmall organic molecule
Emp. Form.C13H13N7S
Mol. Mass.299.354
SMILESCc1csc2nc(c(\C=N\NC(N)=N)n12)-c1cccnc1