Reaction Details
TargetPhosphatidylinositol 4,5-bisphosphate 3-kinase catalytic subunit beta isoform
LigandBDBM50315213
Substrate/Competitorn/a
Meas. Tech.ChEMBL_776283 (CHEMBL1914128)
IC50 58.0±n/a nM
Citation Rewcastle, GWGamage, SAFlanagan, JUFrederick, RDenny, WABaguley, BCKestell, PSingh, RKendall, JDMarshall, ESLill, CLLee, WJKolekar, SBuchanan, CMJamieson, SMShepherd, PR Synthesis and biological evaluation of novel analogues of the pan class I phosphatidylinositol 3-kinase (PI3K) inhibitor 2-(difluoromethyl)-1-[4,6-di(4-morpholinyl)-1,3,5-triazin-2-yl]-1H-benzimidazole (ZSTK474). J Med Chem54:7105-26 (2011) 
 
Phosphatidylinositol 4,5-bisphosphate 3-kinase catalytic subunit beta isoform
Name:Phosphatidylinositol 4,5-bisphosphate 3-kinase catalytic subunit beta isoform
Type:Enzyme Subunit
Mol. Mass.:122769.00
Organism:Homo sapiens (Human)
Description:P42338
Residue:1070
BDBM50315213
NameBDBM50315213
Synonyms:2-(difluoromethyl)-1-(4,6-dimorpholin-4-yl-1,3,5-triazin-2-yl)-1H-benzimidazole CHEMBL586702 | TCMDC-137004
TypeSmall organic molecule
Emp. Form.C19H21F2N7O2
Mol. Mass.417.4125
SMILESFC(F)c1nc2ccccc2n1-c1nc(nc(n1)N1CCOCC1)N1CCOCC1