Reaction Details
TargetAndrogen receptor
LigandBDBM50355940
Substrate/Competitorn/a
Meas. Tech.ChEMBL_775976 (CHEMBL1912974)
IC50 45±n/a nM
Citation Nagata, NMiyakawa, MAmano, SFuruya, KYamamoto, NNejishima, HInoguchi, K Tetrahydroquinolines as a novel series of nonsteroidal selective androgen receptor modulators: structural requirements for better physicochemical and biological properties. Bioorg Med Chem Lett21:6310-3 (2011) 
 
Androgen receptor
Name:Androgen receptor
Type:Enzyme
Mol. Mass.:98219.08
Organism:Rattus norvegicus (Rat)
Description:P15207
Residue:902
BDBM50355940
NameBDBM50355940
Synonyms:CHEMBL1910408
TypeSmall organic molecule
Emp. Form.C15H22N2O4
Mol. Mass.294.3462
SMILESCCO[C@H]1C[C@H](Nc2ccc(cc12)[N+]([O-])=O)C(C)(C)CO