Reaction Details
TargetAndrogen receptor
LigandBDBM50355944
Substrate/Competitorn/a
Meas. Tech.ChEMBL_775976 (CHEMBL1912974)
IC50>1000±n/a nM
Citation Nagata, NMiyakawa, MAmano, SFuruya, KYamamoto, NNejishima, HInoguchi, K Tetrahydroquinolines as a novel series of nonsteroidal selective androgen receptor modulators: structural requirements for better physicochemical and biological properties. Bioorg Med Chem Lett21:6310-3 (2011) 
 
Androgen receptor
Name:Androgen receptor
Type:Enzyme
Mol. Mass.:98219.08
Organism:Rattus norvegicus (Rat)
Description:P15207
Residue:902
BDBM50355944
NameBDBM50355944
Synonyms:CHEMBL1910413
TypeSmall organic molecule
Emp. Form.C13H19N3O3
Mol. Mass.265.3083
SMILESCC(C)(CO)[C@@H]1C[C@H](N)c2cc(ccc2N1)[N+]([O-])=O