Reaction Details
TargetAndrogen receptor
LigandBDBM50355937
Substrate/Competitorn/a
Meas. Tech.ChEMBL_775978 (CHEMBL1912976)
IC50 61000±n/a nM
Citation Nagata, NMiyakawa, MAmano, SFuruya, KYamamoto, NNejishima, HInoguchi, K Tetrahydroquinolines as a novel series of nonsteroidal selective androgen receptor modulators: structural requirements for better physicochemical and biological properties. Bioorg Med Chem Lett21:6310-3 (2011) 
 
Androgen receptor
Name:Androgen receptor
Type:Enzyme
Mol. Mass.:98219.08
Organism:Rattus norvegicus (Rat)
Description:P15207
Residue:902
BDBM50355937
NameBDBM50355937
Synonyms:CHEMBL1910406
TypeSmall organic molecule
Emp. Form.C16H22N2O4
Mol. Mass.306.3569
SMILESCC(C)(CO)[C@H]1Nc2ccc(cc2[C@H]2OCCC[C@@H]12)[N+]([O-])=O