Reaction Details
TargetMitogen-activated protein kinase 14
LigandBDBM50355998
Substrate/Competitorn/a
Meas. Tech.ChEMBL_774897 (CHEMBL1913342)
IC50 4.7±n/a nM
Citation Eastwood, PGonzález, JGómez, ECaturla, FAguilar, NMir, MAiguadé, JMatassa, VBalagué, COrellana, ADomínguez, M Indolin-2-one p38a inhibitors III: bioisosteric amide replacement. Bioorg Med Chem Lett21:6253-7 (2011) 
 
Mitogen-activated protein kinase 14
Name:Mitogen-activated protein kinase 14
Type:Serine/threonine-protein kinase
Mol. Mass.:41286.76
Organism:Homo sapiens (Human)
Description:Q16539
Residue:360
BDBM50355998
NameBDBM50355998
Synonyms:CHEMBL1911333 | US8772288, 67
TypeSmall organic molecule
Emp. Form.C23H25N5O3S
Mol. Mass.451.541
SMILESCc1nnc([nH]1)-c1ccc(C)c(c1)-c1ccc2c(NC(=O)C22CCN(CC2)S(C)(=O)=O)c1