Reaction Details
TargetMitogen-activated protein kinase 14
LigandBDBM50355999
Substrate/Competitorn/a
Meas. Tech.ChEMBL_774897 (CHEMBL1913342)
IC50 0.9±n/a nM
Citation Eastwood, PGonzález, JGómez, ECaturla, FAguilar, NMir, MAiguadé, JMatassa, VBalagué, COrellana, ADomínguez, M Indolin-2-one p38a inhibitors III: bioisosteric amide replacement. Bioorg Med Chem Lett21:6253-7 (2011) 
 
Mitogen-activated protein kinase 14
Name:Mitogen-activated protein kinase 14
Type:Serine/threonine-protein kinase
Mol. Mass.:41286.76
Organism:Homo sapiens (Human)
Description:Q16539
Residue:360
BDBM50355999
NameBDBM50355999
Synonyms:CHEMBL1911334
TypeSmall organic molecule
Emp. Form.C23H23N3O2
Mol. Mass.373.4476
SMILESCc1ccc2c(NC3CC3)noc2c1-c1ccc2c(NC(=O)C22CCCC2)c1