Reaction Details
TargetMitogen-activated protein kinase 14
LigandBDBM50356001
Substrate/Competitorn/a
Meas. Tech.ChEMBL_774897 (CHEMBL1913342)
IC50 4±n/a nM
Citation Eastwood, PGonzález, JGómez, ECaturla, FAguilar, NMir, MAiguadé, JMatassa, VBalagué, COrellana, ADomínguez, M Indolin-2-one p38a inhibitors III: bioisosteric amide replacement. Bioorg Med Chem Lett21:6253-7 (2011) 
 
Mitogen-activated protein kinase 14
Name:Mitogen-activated protein kinase 14
Type:Serine/threonine-protein kinase
Mol. Mass.:41286.76
Organism:Homo sapiens (Human)
Description:Q16539
Residue:360
BDBM50356001
NameBDBM50356001
Synonyms:CHEMBL1911336
TypeSmall organic molecule
Emp. Form.C22H20ClN3O2
Mol. Mass.393.866
SMILESClc1cc2c(NC(=O)C22CCCC2)cc1-c1cccc2c(NC3CC3)noc12