Reaction Details
TargetMitogen-activated protein kinase 14
LigandBDBM50356003
Substrate/Competitorn/a
Meas. Tech.ChEMBL_774897 (CHEMBL1913342)
IC50 0.16±n/a nM
Citation Eastwood, PGonzález, JGómez, ECaturla, FAguilar, NMir, MAiguadé, JMatassa, VBalagué, COrellana, ADomínguez, M Indolin-2-one p38a inhibitors III: bioisosteric amide replacement. Bioorg Med Chem Lett21:6253-7 (2011) 
 
Mitogen-activated protein kinase 14
Name:Mitogen-activated protein kinase 14
Type:Serine/threonine-protein kinase
Mol. Mass.:41286.76
Organism:Homo sapiens (Human)
Description:Q16539
Residue:360
BDBM50356003
NameBDBM50356003
Synonyms:CHEMBL1911338
TypeSmall organic molecule
Emp. Form.C23H23N3O3
Mol. Mass.389.447
SMILESCc1ccc2c(NC3CC3)noc2c1-c1ccc2c(NC(=O)C22CCOCC2)c1